Building error

Help with using MiniMyth's build system

Moderator: Pablo

Post Reply
frbaresi
Member
Posts: 26
Joined: Fri Jan 16, 2009 6:53 pm

Building error

Post by frbaresi »

Hy
I'm trying to build the gar system with the flag 'mm_software=flash' enabled (on .minimyth/minimyth.conf.mk), and i'm getting an error with /gdk-pixbuf .
I've also tried to build gtk (only), and i'm getting the same error. :(

Error message:
rcs@rcs-desktop:~/gar-minimyth-0.21.0-63/script/gtk/gtk+$ make build
[===== NOW BUILDING: gtk+-2.14.6 =====]
[fetch] complete for gtk+.
[checksum] complete for gtk+.
[extract] complete for gtk+.
[patch] complete for gtk+.
make[1]: Entering directory `/home/rcs/gar-minimyth-0.21.0-63/script/gtk/gtk+'
make[1]: `../../devel/build-system-bins/cookies/build.d/install' is up to date.
==> Building gtk/gtk+ as a dependency
make[2]: Entering directory `/home/rcs/gar-minimyth-0.21.0-63/script/gtk/gtk+'
[===== NOW BUILDING: gtk+-2.14.6 =====]
[fetch] complete for gtk+.
[checksum] complete for gtk+.
[extract] complete for gtk+.
[patch] complete for gtk+.
[configure] complete for gtk+.
==> Running make in work/build.d/gtk+-2.14.6
make[3]: Entering directory `/home/rcs/gar-minimyth-0.21.0-63/script/gtk/gtk+/work/build.d/gtk+-2.14.6'
make all-recursive
make[4]: Entering directory `/home/rcs/gar-minimyth-0.21.0-63/script/gtk/gtk+/work/build.d/gtk+-2.14.6'
Making all in po
make[5]: Entering directory `/home/rcs/gar-minimyth-0.21.0-63/script/gtk/gtk+/work/build.d/gtk+-2.14.6/po'
make[5]: Nothing to be done for `all'.
make[5]: Leaving directory `/home/rcs/gar-minimyth-0.21.0-63/script/gtk/gtk+/work/build.d/gtk+-2.14.6/po'
Making all in po-properties
make[5]: Entering directory `/home/rcs/gar-minimyth-0.21.0-63/script/gtk/gtk+/work/build.d/gtk+-2.14.6/po-properties'
make[5]: Nothing to be done for `all'.
make[5]: Leaving directory `/home/rcs/gar-minimyth-0.21.0-63/script/gtk/gtk+/work/build.d/gtk+-2.14.6/po-properties'
Making all in gdk-pixbuf
make[5]: Entering directory `/home/rcs/gar-minimyth-0.21.0-63/script/gtk/gtk+/work/build.d/gtk+-2.14.6/gdk-pixbuf'
make all-recursive
make[6]: Entering directory `/home/rcs/gar-minimyth-0.21.0-63/script/gtk/gtk+/work/build.d/gtk+-2.14.6/gdk-pixbuf'
Making all in pixops
make[7]: Entering directory `/home/rcs/gar-minimyth-0.21.0-63/script/gtk/gtk+/work/build.d/gtk+-2.14.6/gdk-pixbuf/pixops'
make[7]: Nothing to be done for `all'.
make[7]: Leaving directory `/home/rcs/gar-minimyth-0.21.0-63/script/gtk/gtk+/work/build.d/gtk+-2.14.6/gdk-pixbuf/pixops'
make[7]: Entering directory `/home/rcs/gar-minimyth-0.21.0-63/script/gtk/gtk+/work/build.d/gtk+-2.14.6/gdk-pixbuf'
/bin/bash ../libtool --mode=link gcc -DGDK_PIXBUF_DISABLE_DEPRECATED -pipe -march=i686 -O2 -m32 -Wall -o libgdk_pixbuf-2.0.la -rpath /home/rcs/gar-minimyth-0.21.0-63/images/build/usr/lib -version-info 1400:6:1400 -export-symbols-regex "^[^_].*" gdk-pixbuf.lo gdk-pixbuf-animation.lo gdk-pixbuf-data.lo gdk-pixbuf-io.lo gdk-pixbuf-loader.lo gdk-pixbuf-scale.lo gdk-pixbuf-simple-anim.lo gdk-pixbuf-scaled-anim.lo gdk-pixbuf-util.lo gdk-pixdata.lo gdk-pixbuf-enum-types.lo pixops/libpixops.la -L//home/rcs/gar-minimyth-0.21.0-63/images/build/usr/lib -lgio-2.0 -lgobject-2.0 -lgmodule-2.0 -lglib-2.0 -lm
libtool: link: rm -fr .libs/libgdk_pixbuf-2.0.exp .libs/libgdk_pixbuf-2.0.ver
libtool: link: //home/rcs/gar-minimyth-0.21.0-63/images/build/usr/bin/nm .libs/gdk-pixbuf.o .libs/gdk-pixbuf-animation.o .libs/gdk-pixbuf-data.o .libs/gdk-pixbuf-io.o .libs/gdk-pixbuf-loader.o .libs/gdk-pixbuf-scale.o .libs/gdk-pixbuf-simple-anim.o .libs/gdk-pixbuf-scaled-anim.o .libs/gdk-pixbuf-util.o .libs/gdk-pixdata.o .libs/gdk-pixbuf-enum-types.o pixops/.libs/libpixops.a | sed -n -e 's/^.*[ ]\([ABCDGIRSTW][ABCDGIRSTW]*\)[ ][ ]*\([_A-Za-z][_A-Za-z0-9]*\)$/ /p' | //home/rcs/gar-minimyth-0.21.0-63/images/build/usr/bin/sed 's/.* //' | sort | uniq > .libs/libgdk_pixbuf-2.0.exp
libtool: link: //home/rcs/gar-minimyth-0.21.0-63/images/build/usr/bin/grep -E -e "^[^_].*" ".libs/libgdk_pixbuf-2.0.exp" > ".libs/libgdk_pixbuf-2.0.expT"
libtool: link: mv -f ".libs/libgdk_pixbuf-2.0.expT" ".libs/libgdk_pixbuf-2.0.exp"
libtool: link: echo "{ global:" > .libs/libgdk_pixbuf-2.0.ver
libtool: link: cat .libs/libgdk_pixbuf-2.0.exp | sed -e "s/\(.*\)/;/" >> .libs/libgdk_pixbuf-2.0.ver
libtool: link: echo "local: *; };" >> .libs/libgdk_pixbuf-2.0.ver
libtool: link: gcc -shared .libs/gdk-pixbuf.o .libs/gdk-pixbuf-animation.o .libs/gdk-pixbuf-data.o .libs/gdk-pixbuf-io.o .libs/gdk-pixbuf-loader.o .libs/gdk-pixbuf-scale.o .libs/gdk-pixbuf-simple-anim.o .libs/gdk-pixbuf-scaled-anim.o .libs/gdk-pixbuf-util.o .libs/gdk-pixdata.o .libs/gdk-pixbuf-enum-types.o -Wl,--whole-archive pixops/.libs/libpixops.a -Wl,--no-whole-archive -L//home/rcs/gar-minimyth-0.21.0-63/images/build/usr/lib -lgio-2.0 -lgobject-2.0 -lgmodule-2.0 -lglib-2.0 -lm -march=i686 -m32 -Wl,-soname -Wl,libgdk_pixbuf-2.0.so.0 -Wl,-version-script -Wl,.libs/libgdk_pixbuf-2.0.ver -o .libs/libgdk_pixbuf-2.0.so.0.1400.6
/home/rcs/gar-minimyth-0.21.0-63/images/build/usr/lib/gcc/i486-linux-gnu/4.3.0/../../../../i486-linux-gnu/bin/ld:.libs/libgdk_pixbuf-2.0.ver:2: ignoring invalid character `\001' in script
/home/rcs/gar-minimyth-0.21.0-63/images/build/usr/lib/gcc/i486-linux-gnu/4.3.0/../../../../i486-linux-gnu/bin/ld:.libs/libgdk_pixbuf-2.0.ver:2: syntax error in VERSION script
collect2: ld returned 1 exit status
make[7]: *** [libgdk_pixbuf-2.0.la] Error 1
make[7]: Leaving directory `/home/rcs/gar-minimyth-0.21.0-63/script/gtk/gtk+/work/build.d/gtk+-2.14.6/gdk-pixbuf'
make[6]: *** [all-recursive] Error 1
make[6]: Leaving directory `/home/rcs/gar-minimyth-0.21.0-63/script/gtk/gtk+/work/build.d/gtk+-2.14.6/gdk-pixbuf'
make[5]: *** [all] Error 2
make[5]: Leaving directory `/home/rcs/gar-minimyth-0.21.0-63/script/gtk/gtk+/work/build.d/gtk+-2.14.6/gdk-pixbuf'
make[4]: *** [all-recursive] Error 1
make[4]: Leaving directory `/home/rcs/gar-minimyth-0.21.0-63/script/gtk/gtk+/work/build.d/gtk+-2.14.6'
make[3]: *** [all] Error 2
make[3]: Leaving directory `/home/rcs/gar-minimyth-0.21.0-63/script/gtk/gtk+/work/build.d/gtk+-2.14.6'
make[2]: *** [build-work/build.d/gtk+-2.14.6/Makefile] Error 2
make[2]: Leaving directory `/home/rcs/gar-minimyth-0.21.0-63/script/gtk/gtk+'
make[1]: *** [../../gtk/gtk+/cookies/build.d/install] Error 2
make[1]: Leaving directory `/home/rcs/gar-minimyth-0.21.0-63/script/gtk/gtk+'
make: *** [imgdep-build] Error 2
rcs@rcs-desktop:~/gar-minimyth-0.21.0-63/script/gtk/gtk+$


Thanks
frbaresi
Member
Posts: 26
Joined: Fri Jan 16, 2009 6:53 pm

Post by frbaresi »

Hy
To solve the problem, I needed to use gtk+2.14.7 instead of gtk+2.14.6
Post Reply